BDBM50365578 CHEMBL1957807
SMILES Fc1ccc(CCN2CCN(CC2)C(=O)c2cnn3cccnc23)c(F)c1
InChI Key InChIKey=BKKMETCOUPGLLH-UHFFFAOYSA-N
Data  2 KI
  Tab Delimited (TSV)   2D SDfile   Computed 3D by Vconf -m prep SDfile
Find this compound or compounds like it in BindingDB:
Activity Spreadsheet -- Enzyme Inhibition Constant Data from BindingDB
Found 1 hit for monomerid = 50365578
Target5-hydroxytryptamine receptor 2A(Homo sapiens (Human))
Arena Pharmaceuticals
Curated by ChEMBL
LigandPNGBDBM50365578(CHEMBL1957807)
Affinity DataKi:  3.80nM. Assay description: Displacement of [125I]-DOI from recombinant human 5HT2A receptor
In DepthDetails ArticlePubMed